make[3]: *** [sapi_apache2.lo] 오류 1 make[3]: 나감 `/usr/local/php/sapi/apache2filter' 디렉토리 make[2]: *** [all-recursive] 오류 1 make[2]: 나감 `/usr/local/php/sapi/apache2filter' 디렉토리 make[1]: *** [all-recursive] 오류 1 make[1]: 나감 `/usr/local/php/sapi' 디렉토리 make: *** [all-recursive] 오류 1 마지막에 이렇게 에러 뜨는데.. 괜찮은가요..??--이 곳에 서명을 적어주십시오. (서명 엄찌롱..+_+)
php 4.3.0-devel 빌드에서 apache2filter 모듈 오류가 난 것은 Apache 2 필터 소스가 맞지 않을 때 생깁니다. 필요하지 않다면 Apache 2 용 옵션을 빼고 다시 configure 하거나, 마지막 오류 로그를 보고 원인을 찾으세요.