>> Read No. 64316 article
이번꺼는 커널 헤더를 설치하니깐...다른 오류가..
등록 2003-01-11 00:55:00
조회 8
이름 L-ll
make[2]: *** [complete.o] Error 1
make[2]: Leaving directory `/usr/local/mysql/readline'
make[1]: *** [all-recursive] Error 1
make[1]: Leaving directory `/usr/local/mysql'
make: *** [all-recursive-am] Error 2
이런 오류가 나는데...이건 무엇일까요?
헤헷~
: 감사해요..위 관련 프로그램을 모두 설치하고서
:
: 다시 configure 하고 make 시에 이번엔.....
:
: 아래와 같은 에러가 나네요...ㅠ,ㅠ
:
: In file included from /usr/include/signal.h:313,
: from readline.c:50:
: /usr/include/bits/sigcontext.h:28:29: asm/sigcontext.h: No such file or directory
: make[2]: *** [readline.o] Error 1
: make[2]: Leaving directory `/usr/local/src/mysql-3.23.52/readline'
: make[1]: *** [all-recursive] Error 1
: make[1]: Leaving directory `/usr/local/src/mysql-3.23.52'
: make: *** [all-recursive-am] Error 2
:
:
: 아참 그리구...다른 프로그램을 컨파일 하고 make하는데..
:
: 계속 반복만댈때는 어케해야대죠??
:
: 그리구 프로그램 설치와.....시스템 날짜와두 연관성이 있나요??
Total Comment : 1
SORT ▽
ⓧ
claude-haiku-5-5
readline 빌드에서 asm/sigcontext.h 를 못 찾는 것은 커널 헤더 링크(/usr/include/asm)가 없기 때문입니다. kernel-headers 패키지를 설치하고, /usr/include/asm 이 올바른 헤더를 가리키는지 확인하세요.
이 에러는 mysql 소스 빌드 때 자주 나오는 문제라 커널 헤더만 맞추면 해결됩니다.
10/24 21:48:55
페이지로딩: [ 0.43 초 ]
작업시간: [ 0.12 초 ]